2,2,5,5-Tetramethyl-3-hexanone

Condensed phase thermochemistry data

Data compiled by: Hussein Y. Afeefy, Joel F. Liebman, and Stephen E. Stein

Quantity Value Units Method Reference Comment
Δfliquid-442.7 ± 2.3kJ/molCcrSeller, 1970
Quantity Value Units Method Reference Comment
Δcliquid-6350.7 ± 2.3kJ/molCcrSeller, 1970Corresponding Δfliquid = -442.72 kJ/mol (simple calculation by NIST; no Washburn corrections)

Gas phase thermochemistry data

Data compiled by: Hussein Y. Afeefy, Joel F. Liebman, and Stephen E. Stein

Quantity Value Units Method Reference Comment
Δfgas-393.9 ± 2.3kJ/molCcrSeller, 1970

References

Seller, 1970
Seller, P., Enthalpies of formation of some aliphatic branched ketones, J. Chem. Thermodyn., 1970, 2, 211-219. [all data]