Dispiro{cyclopropane-6,1'-pentacyclo[6.3.1.0(2,7).0(3,5).0(9,11)]-dodecane-12,1"-cyclopropane}

Phase change data

Data compiled as indicated in comments:
ALS - Hussein Y. Afeefy, Joel F. Liebman, and Stephen E. Stein
DRB - Donald R. Burgess, Jr.

Quantity Value Units Method Reference Comment
Δvap67.80 ± 0.50kJ/molCLuk'yanova, Timofeeva, et al., 1991ALS
Δvap67.8kJ/molN/ALuk'yanova, Timofeeva, et al., 1991DRB

References

Luk'yanova, Timofeeva, et al., 1991
Luk'yanova, V.A.; Timofeeva, L.P.; Kozina, M.P.; Kazimirchik, I.V.; Kotel'nikova, T.A., Enthalpies of formation of certain polycyclic hydrocarbons, Russ. J. Phys. Chem. (Engl. Transl.), 1991, 65, 436-439. [all data]