Tetraisobutylsucccinonitrile

Condensed phase thermochemistry data

Data compiled by: Hussein Y. Afeefy, Joel F. Liebman, and Stephen E. Stein

Quantity Value Units Method Reference Comment
Δfsolid-264.4 ± 3.7kJ/molCcbBarbe, Beckhaus, et al., 1983
Quantity Value Units Method Reference Comment
Δcsolid-12750.7 ± 3.7kJ/molCcbBarbe, Beckhaus, et al., 1983

Phase change data

Data compiled as indicated in comments:
ALS - Hussein Y. Afeefy, Joel F. Liebman, and Stephen E. Stein
DRB - Donald R. Burgess, Jr.
AC - William E. Acree, Jr., James S. Chickos

Quantity Value Units Method Reference Comment
Δsub36.50kcal/molEBarbe, Beckhaus, et al., 1983ALS
Δsub36.50kcal/molN/ABarbe, Beckhaus, et al., 1983DRB

Enthalpy of fusion

ΔfusH (kcal/mol) Temperature (K) Reference Comment
8.200360.2Barbe, Beckhaus, et al., 1983AC

References

Barbe, Beckhaus, et al., 1983
Barbe, W.; Beckhaus, H.D.; Lindner, H.J.; Ruechardt, C., Substituent effects on the carbon-carbon bond strength. 1. Structure and strain enthalpy of tetrasubstituted succinonitriles, Chem. Ber., 1983, 116, 1017-1041. [all data]