1,5-Heptadiene, 7,7,7-trifluoro-, (E)-

Reaction thermochemistry data

Data compiled by: Hussein Y. Afeefy, Joel F. Liebman, and Stephen E. Stein

Individual Reactions

(Z)-7,7,7-Trifluoro-1,5-heptadiene = 1,5-Heptadiene, 7,7,7-trifluoro-, (E)-

By formula: C7H9F3 = C7H9F3

Quantity Value Units Method Reference Comment
Δr-6.82kJ/molEqkDolbier and Medinger, 1982gas phase

3-Trifluoromethyl-1,5-hexadiene = 1,5-Heptadiene, 7,7,7-trifluoro-, (E)-

By formula: C7H9F3 = C7H9F3

Quantity Value Units Method Reference Comment
Δr-0.96kJ/molEqkDolbier and Medinger, 1982gas phase

References

Dolbier and Medinger, 1982
Dolbier, W.R., Jr.; Medinger, K.S., The thermodynamic effect of fluorine as a substituent. Allylic CF3 and CF2H, Tetrahedron, 1982, 38, 2411-2413. [all data]