4,5-Dipropyl-4,5-bis-(4-tert-butylphenyl)octane

Phase change data

Data compiled as indicated in comments:
TRC - Thermodynamics Research Center, NIST Boulder Laboratories, Chris Muzny director
ALS - Hussein Y. Afeefy, Joel F. Liebman, and Stephen E. Stein
DRB - Donald R. Burgess, Jr.
AC - William E. Acree, Jr., James S. Chickos
DH - Eugene S. Domalski and Elizabeth D. Hearing

Quantity Value Units Method Reference Comment
Tfus419.KN/AKratt, Beckhaus, et al., 1983Uncertainty assigned by TRC = 1. K; TRC
Quantity Value Units Method Reference Comment
Δsub198.kJ/molEKratt, Beckhaus, et al., 1983, 2ΔHfussion = 9.7±0.1 kcal/mol at 146°C; ALS
Δsub198.0kJ/molN/AKratt, Beckhaus, et al., 1983, 2DRB

Enthalpy of fusion

ΔfusH (kJ/mol) Temperature (K) Method Reference Comment
40.58419.DSCKratt, Beckhaus, et al., 1983AC
36.110452.N/AWilhoit and Dole, 1953DH

Entropy of fusion

ΔfusS (J/mol*K) Temperature (K) Reference Comment
79.9452.Wilhoit and Dole, 1953DH

In addition to the Thermodynamics Research Center (TRC) data available from this site, much more physical and chemical property data is available from the following TRC products:

References

Kratt, Beckhaus, et al., 1983
Kratt, G.; Beckhaus, H.D.; Bernioehr, W.; Ruechardt, C., Thermolabile hydrocarbons. XVII. Enthalpies of combustion and formation of ten sym-tetraalkyl-1,2-diarylethanes, Thermochim. Acta, 1983, 62, 279-294. [all data]

Kratt, Beckhaus, et al., 1983, 2
Kratt, G.; Beckhaus, H.D.; Bernlohr, W.; Ruchardt, C., Thermolabile kohlenwasserstoffe. XVII. Verbrennungsenthalpie und bildungsenthalpie von zehn sym.-tetraalkyl-1,2-diarylethanen, Thermochim. Acta, 1983, 62, 279-194. [all data]

Wilhoit and Dole, 1953
Wilhoit, R.C.; Dole, M., Specific heat of synthetic high polymers. II. Polyhexamethylene adipamide and sebacamide, J. Phys. Chem., 1953, 57, 14-21. [all data]