Tricyclo[4.3.1.1<sup>2,5</sup>]undec-3-ene, (1&#945;,2&#946;,5&#946;,6&#945;)-

Gas phase ion energetics data

Data compiled by: Sharon G. Lias, John E. Bartmess, Joel F. Liebman, John L. Holmes, Rhoda D. Levin, and W. Gary Mallard

Ionization energy determinations

IE (eV) Method Reference Comment
8.4PETombo, Ammann, et al., 1983
8.68PETombo, Ammann, et al., 1983Vertical value

References

Tombo, Ammann, et al., 1983
Tombo, G.M.R.; Ammann, H.J.; Muller, K.; Ganter, C., 5. Nucleophilic addition to C,C-double bonds. VII. Study of proximity effects in olefinic alcohols and amines by photoelectron spectroscopy, Helv. Chim. Acta, 1983, 66, 50. [all data]