1-(N-Benzyl-N-isobutyryl)amino-6-(2-cyanoethyl)cyclohexene

Reaction thermochemistry data

Data compiled by: Hussein Y. Afeefy, Joel F. Liebman, and Stephen E. Stein

Individual Reactions

1-(N-Benzyl-N-isobutyryl)amino-6-(2-cyanoethyl)cyclohexene = C20H26N2O

By formula: C20H26N2O = C20H26N2O

Quantity Value Units Method Reference Comment
Δr-21.9 ± 3.1kJ/molEqkErzhanov, Kayunova, et al., 1983liquid phase; solvent: CCl4; Isomerization NMR

References

Erzhanov, Kayunova, et al., 1983
Erzhanov, K.B.; Kayunova, L.A.; Yakimovich, S.I.; Umarova, Z.N.; Krasnomolova, L.P., Enamine-enamine isomerism in the products of N-acylation of 2-(β-cyanoethyl)cyclohexanone benzylimine, Zh. Org. Khim., 1983, 19, 2329-2332. [all data]