4(1H)-Quinolinone, 1-methyl-

Gas phase ion energetics data

Data compiled by: Sharon G. Lias, Rhoda D. Levin, and Sherif A. Kafafi

Ionization energy determinations

IE (eV) Method Reference
7.95PEPfister-Guillouzo, Guimon, et al., 1981

References

Pfister-Guillouzo, Guimon, et al., 1981
Pfister-Guillouzo, G.; Guimon, C.; Frank, J.; Ellison, J.; Katritzky, A.R., Tautomeric pyridines,26. A photoelectron spectral study of the vapour phase tautomerism of 2- and 4-quinolone, Liebigs Ann. Chem., 1981, 366. [all data]