Benzene, 1,2-dimethyl-3-nitro-

Gas phase ion energetics data

Data compiled by: John E. Bartmess

Electron affinity determinations

EA (eV) Method Reference Comment
0.85 ± 0.10TDEqChowdhury, Heinis, et al., 1986ΔGea=-19.4 kcal/mol; ΔSea=-1.1 eu
0.915 ± 0.048IMREFukuda and McIver, 1985ΔGea(355 K) = -20.7 kcal/mol; ΔSea =-1.1, est. from data in Chowdhury, Heinis, et al., 1986

References

Chowdhury, Heinis, et al., 1986
Chowdhury, S.; Heinis, T.; Grimsrud, E.P.; Kebarle, P., Entropy Changes and Electron Affinities from Gas-Phase Electron Transfer Equilibria: A- + B = A + B-, J. Phys. Chem., 1986, 90, 12, 2747, https://doi.org/10.1021/j100403a037 . [all data]

Fukuda and McIver, 1985
Fukuda, E.K.; McIver, R.T., Jr., Relative electron affinities of substituted benzophenones, nitrobenzenes, and quinones. [Anchored to EA(SO2) from 74CEL/BEN], J. Am. Chem. Soc., 1985, 107, 2291. [all data]