Cyclotridecanone

Phase change data

Data compiled by: Robert L. Brown and Stephen E. Stein

Reduced pressure boiling point

Tboil (K) Pressure (bar) Reference
419.20.015Aldrich Chemical Company Inc., 1990

Kovats' RI, non-polar column, isothermal

View large format table.

Column type Active phase Temperature (C) I Reference Comment
PackedOV-101220.1661.3Didaoui, Touabet, et al., 1997N2, Chromosorb G HP; Column length: 2. m
CapillarySE-30220.1655.0Didaoui, Touabet, et al., 199727. m/0.4 mm/1.13 μm, N2, Chromosorb G HP
CapillarySE-30200.1647.6Didaoui, Touabet, et al., 199727. m/0.4 mm/0.1 μm, N2, Chromosorb G HP
CapillaryApolane220.1672.8Didaoui, Touabet, et al., 199743. m/0.29 mm/0.28 μm, N2
PackedApolane220.1677.8Didaoui, Touabet, et al., 19972. m/0.29 mm/0.28 μm, N2, Chromosorb G HP

References

Aldrich Chemical Company Inc., 1990
Aldrich Chemical Company Inc., Catalog Handbook of Fine Chemicals, Aldrich Chemical Company, Inc., Milwaukee WI, 1990, 1. [all data]