Cyclizine

Kovats' RI, non-polar column, isothermal

View large format table.

Column type Active phase Temperature (C) I Reference Comment
CapillaryBP-1200.2020.Japp, Gill, et al., 198725. m/0.22 mm/0.25 μm, N2
CapillaryBP-1200.2027.Japp, Gill, et al., 198725. m/0.53 mm/1. μm, N2
PackedSE-30220.2027.Musumarra, Scarlata, et al., 1987N2, 1% se-30 on Anachrom ABS(80-100mesh); Column length: 2. m

Kovats' RI, non-polar column, temperature ramp

View large format table.

Column type Active phase I Reference Comment
CapillarySE-302017.Schepers, Wijsbeek, et al., 198225. m/0.49 mm/1.14 μm, 100. C @ 2. min, 8. K/min, 275. C @ 15. min

Kovats' RI, non-polar column, custom temperature program

View large format table.

Column type Active phase I Reference Comment
PackedOV-1012010.McLinden and Stenhouse, 1979N2, Chromosorb W; Column length: 2. m; Program: not specified
PackedSE-302010.Moffat, Stead, et al., 1974Column length: 2. m; Program: not specified

Normal alkane RI, non-polar column, temperature ramp

View large format table.

Column type Active phase I Reference Comment
PackedSE-302020.MHA, 9999Nitrogen, Chromosorb G AW DMCS (80-100 mesh); Column length: 2. m; Tstart: 100. C; Tend: 300. C
PackedOV-12020.Marozzi, Gambaro, et al., 1982Gas Chrom P, 2.5 K/min; Column length: 2. m; Tstart: 120. C; Tend: 200. C
PackedSE-302035.Marozzi, Gambaro, et al., 1982Gas Chrom P, 2.5 K/min; Column length: 2. m; Tstart: 120. C; Tend: 200. C

Normal alkane RI, non-polar column, custom temperature program

View large format table.

Column type Active phase I Reference Comment
OtherMethyl Silicone2020.Ardrey and Moffat, 1981Program: not specified

References

Japp, Gill, et al., 1987
Japp, M.; Gill, R.; Osselton, M.D., Comparison of drug retention indices determined on packed, wide bore capillary and narrow bore capillary columns, J. Forensic Sci., 1987, 32, 6, 1574-1586. [all data]

Musumarra, Scarlata, et al., 1987
Musumarra, G.; Scarlata, G.; Romano, G.; Cappello, G.; Clementi, S.; Giulietti, G., Qualitative organic analysis. Part 2. Identification of drugs by principal components analysis of standardized TLC data in four eluent systems and of retention indices on SE 30, J. Anal. Toxicol., 1987, 11, 4, 154-163, https://doi.org/10.1093/jat/11.4.154 . [all data]

Schepers, Wijsbeek, et al., 1982
Schepers, P.; Wijsbeek, J.; Franke, J.P.; de Zeeuw, R.A., Applicability of capillary gas chromatography to substance identification in toxicology by means of retention indices, J. Forensic Sci., 1982, 27, 1, 49-60. [all data]

McLinden and Stenhouse, 1979
McLinden, V.J.; Stenhouse, A.M., A chromatography system for drug identification, Forensic Sci. Int., 1979, 13, 71-79, https://doi.org/10.1016/0379-0738(79)90265-2 . [all data]

Moffat, Stead, et al., 1974
Moffat, A.C.; Stead, A.H.; Smalldon, K.W., Optimum use of paper, thin-layer and gas-liquid chromatography for the identification of basic drugs. III. Gas-liquid chromatography, J. Chromatogr., 1974, 90, 1, 19-33, https://doi.org/10.1016/S0021-9673(01)94770-3 . [all data]

MHA, 9999
MHA, Directorate of ForensicScience., Forensic Toxicology, 9999. [all data]

Marozzi, Gambaro, et al., 1982
Marozzi, E.; Gambaro, V.; Saligari, E.; Mariani, R.; Lodi, F., Use of the retention index in gas chromatographic studies of drugs, J. Anal. Toxicol., 1982, 6, 4, 185-192, https://doi.org/10.1093/jat/6.4.185 . [all data]

Ardrey and Moffat, 1981
Ardrey, R.E.; Moffat, A.C., Gas-liquid chromatographic retention indices of 1318 substances of toxicological interest on SE-30 or OV-1 stationary phase, J. Chromatogr., 1981, 220, 3, 195-252, https://doi.org/10.1016/S0021-9673(00)81925-1 . [all data]