Benzene, (2-chloro-1-methylethyl)-

Normal alkane RI, non-polar column, temperature ramp

View large format table.

Column type Active phase I Reference Comment
CapillaryOV-1011152.Zenkevich, 2001N2, 4. K/min; Column length: 25. m; Column diameter: 0.20 mm; Tstart: 60. C; Tend: 240. C

Normal alkane RI, non-polar column, custom temperature program

View large format table.

Column type Active phase I Reference Comment
CapillaryMethyl Silicone1131.Zenkevich, 1999Program: not specified

References

Zenkevich, 2001
Zenkevich, I.G., Interpretation of Gas Chromatographic Retention Indices in estimation of Structures of Isomeric Products of Radical Chlorinating of Alkyl Arenes, Zh. Org. Khim., 2001, 37, 2, 283-293. [all data]

Zenkevich, 1999
Zenkevich, I.G., Mutual Correlation between Gas-Chromatographic Retention Indices of Organic Compounds from Different Series, Zh. Anal. Khim., 1999, 54, 12, 1272-1279. [all data]