5-Decanone

Kovats' RI, non-polar column, isothermal

View large format table.

Column type Active phase Temperature (C) I Reference Comment
PackedSE-30130.1162.Bierl, Beroza, et al., 1972Column length: 3.0 m

Kovats' RI, non-polar column, temperature ramp

View large format table.

Column type Active phase I Reference Comment
CapillaryDB-11155.Takeoka, Perrino, et al., 199660. m/0.25 mm/0.25 μm, 30. C @ 4. min, 2. K/min; Tend: 220. C
CapillaryDB-11155.Takeoka, Perrino, et al., 199660. m/0.25 mm/0.25 μm, 30. C @ 4. min, 2. K/min; Tend: 220. C

Normal alkane RI, polar column, temperature ramp

View large format table.

Column type Active phase I Reference Comment
CapillaryDB-Wax1373.Duque, Bonilla, et al., 200130. m/0.25 mm/0.25 μm, Helium, 4. K/min, 220. C @ 30. min; Tstart: 25. C

Phase change data

Data compiled by: Thermodynamics Research Center, NIST Boulder Laboratories, Chris Muzny director

Quantity Value Units Method Reference Comment
Tboil477.KN/ABaykut and Ozeris, 1956Uncertainty assigned by TRC = 4. K
Tboil477.KN/AFranzen, 1954Uncertainty assigned by TRC = 3. K
Quantity Value Units Method Reference Comment
Tfus263.9KN/ABaykut and Ozeris, 1956Uncertainty assigned by TRC = 3. K
Quantity Value Units Method Reference Comment
Tc661.0KN/APulliam, Gude, et al., 1995Uncertainty assigned by TRC = 0.4 K
Quantity Value Units Method Reference Comment
ρc1.59mol/lN/APulliam, Gude, et al., 1995Uncertainty assigned by TRC = 0.004 mol/l

In addition to the Thermodynamics Research Center (TRC) data available from this site, much more physical and chemical property data is available from the following TRC products:

References

Bierl, Beroza, et al., 1972
Bierl, B.A.; Beroza, M.; Aldridge, M.H., Effect of functional-group position on retention indices of six classes of compounds on four stationary phases, J. Chromatogr. Sci., 1972, 10, 12, 712-715, https://doi.org/10.1093/chromsci/10.12.712 . [all data]

Takeoka, Perrino, et al., 1996
Takeoka, G.; Perrino, C., Jr.; Buttery, R., Volatile constituents of used frying oils, J. Agric. Food Chem., 1996, 44, 3, 654-660, https://doi.org/10.1021/jf950430m . [all data]

Duque, Bonilla, et al., 2001
Duque, C.; Bonilla, A.; Bautista, E.; Zea, S., Exudation of low molecular wight compounds (thiobismethane, methyl isocyanide, amd methyl isothiocyanate) as a possible chemical defense mechanism in the marine sponge Ircinia felix, Biochem. Systematics Ecol., 2001, 29, 5, 459-467, https://doi.org/10.1016/S0305-1978(00)00081-8 . [all data]