Pentanoic acid, 2-ethyl-, methyl ester

Kovats' RI, non-polar column, isothermal

View large format table.

Column type Active phase Temperature (C) I Reference Comment
PackedSqualane120.884.Schomburg, 1964

References

Schomburg, 1964
Schomburg, G., Gas-Chromatographische Retentionsdaten und Struktur Chemischer Verbindungen. I. Verzweigte Aliphatische und Alicyclische Carbonsäure-Methylester, J. Chromatogr., 1964, 14, 157-177, https://doi.org/10.1016/S0021-9673(00)86608-X . [all data]