Aziridine, 1-(1-propenyl)-, (E)-

Gas phase ion energetics data

Data compiled as indicated in comments:
LLK - Sharon G. Lias, Rhoda D. Levin, and Sherif A. Kafafi

Ionization energy determinations

IE (eV) Method Reference Comment
7.9PEMuller and Previdoli, 1981LLK
8.34PEMuller and Previdoli, 1981Vertical value; LLK

References

Muller and Previdoli, 1981
Muller, K.; Previdoli, F., 247. Enamines. III. A theoretical and photoelectron spectroscopic study of the molecular and electronic structures of aziridine enamines, Helv. Chim. Acta, 1981, 64, 2508. [all data]