Tartronic acid

Condensed phase thermochemistry data

Data compiled by: Hussein Y. Afeefy, Joel F. Liebman, and Stephen E. Stein

Quantity Value Units Method Reference Comment
Δfsolid-1068.4 ± 1.4kJ/molCcbAl-Takhin, Pilcher, et al., 1983

Gas phase thermochemistry data

Data compiled by: Hussein Y. Afeefy, Joel F. Liebman, and Stephen E. Stein

Quantity Value Units Method Reference Comment
Δfgas-227.5 ± 0.36kcal/molCcbAl-Takhin, Pilcher, et al., 1983

Phase change data

Data compiled as indicated in comments:
ALS - Hussein Y. Afeefy, Joel F. Liebman, and Stephen E. Stein
DRB - Donald R. Burgess, Jr.

Quantity Value Units Method Reference Comment
Δsub27.82 ± 0.07kcal/molCAl-Takhin, Pilcher, et al., 1983ALS
Δsub27.82kcal/molN/AAl-Takhin, Pilcher, et al., 1983DRB

References

Al-Takhin, Pilcher, et al., 1983
Al-Takhin, G.; Pilcher, G.; Bickerton, J., Standard enthalpies of formation of diamine(dicarboxylato)platinum(II) complexes and of bis(pentane-2,4-dionato)platinum(II): the mean Pt-O bond dissociation enthalpies, J. Chem. Soc. Dalton Trans., 1983, 2657-2659. [all data]