Chloromethyl 4-chlorononanoate

Kovats' RI, non-polar column, isothermal

View large format table.

Column type Active phase Temperature (C) I Reference Comment
CapillarySE-30140.1551.Haken, Madden, et al., 1984N2; Column length: 25. m; Column diameter: 0.22 mm
CapillarySE-30160.1549.Haken, Madden, et al., 1984N2; Column length: 25. m; Column diameter: 0.22 mm
CapillarySE-30180.1556.Haken, Madden, et al., 1984N2; Column length: 25. m; Column diameter: 0.22 mm

Kovats' RI, polar column, isothermal

View large format table.

Column type Active phase Temperature (C) I Reference Comment
CapillaryCarbowax 20M140.2090.Haken, Madden, et al., 1984N2; Column length: 22. m; Column diameter: 0.3 mm
CapillaryCarbowax 20M160.2115.Haken, Madden, et al., 1984N2; Column length: 22. m; Column diameter: 0.3 mm
CapillaryCarbowax 20M180.2122.Haken, Madden, et al., 1984N2; Column length: 22. m; Column diameter: 0.3 mm

References

Haken, Madden, et al., 1984
Haken, J.K.; Madden, B.G.; Korhonen, I.O.O., Gas chromatography of homologous esters. XXVI. Capillary column studies of the chloromethyl esters of C5-C12 n-carboxylic acids, J. Chromatogr., 1984, 298, 150-158, https://doi.org/10.1016/S0021-9673(01)92703-7 . [all data]