Phenol, 4,4'-(1-methylethylidene)bis[2,6-dibromo-

Phase change data

Data compiled by: William E. Acree, Jr., James S. Chickos

Enthalpy of fusion

ΔfusH (kJ/mol) Temperature (K) Method Reference
29.1451.5DSCKuramochi, Kawamoto, et al., 2008

References

Kuramochi, Kawamoto, et al., 2008
Kuramochi, Hidetoshi; Kawamoto, Katsuya; Miyazaki, Kohei; Nagahama, Kunio; Maeda, Kouji; Li, Xian-Wei; Shibata, Etsuro; Nakamura, Takashi; Sakai, Shin-Ichi, DETERMINATION OF PHYSICOCHEMICAL PROPERTIES OF TETRABROMOBISPHENOL A, Environ Toxicol Chem, 2008, 27, 12, 2413, https://doi.org/10.1897/07-472.1 . [all data]