Bromopentachloroethane

Phase change data

Data compiled by: William E. Acree, Jr., James S. Chickos

Enthalpy of sublimation

ΔsubH (kJ/mol) Temperature (K) Reference Comment
44.4398.Stephenson and Malanowski, 1987Based on data from 383. - 433. K. See also Higuchi, Endow, et al., 1949.

References

Stephenson and Malanowski, 1987
Stephenson, Richard M.; Malanowski, Stanislaw, Handbook of the Thermodynamics of Organic Compounds, 1987, https://doi.org/10.1007/978-94-009-3173-2 . [all data]

Higuchi, Endow, et al., 1949
Higuchi, Takeru.; Endow, Noboru.; Willard, John E., The Preparation and Vapor Pressure of Bromopentachloroethane; the Vapor Pressures of Heptachloropropane and Dibromotetrachloroethane, J. Am. Chem. Soc., 1949, 71, 1, 365-366, https://doi.org/10.1021/ja01169a507 . [all data]