trans-1,2-Bis(benzylthio)-ethylene

Gas phase thermochemistry data

Data compiled by: Hussein Y. Afeefy, Joel F. Liebman, and Stephen E. Stein

Quantity Value Units Method Reference Comment
Δcgas-9923.9 ± 1.2kJ/molCcrGeiseler and Schaffernicht, 1967

References

Geiseler and Schaffernicht, 1967
Geiseler, G.; Schaffernicht, H., Über ein Rotations-Metallblock-Kalorimeter und die bildungstenthalpien des cis- und trans-1,2-Dibenzyl-dithioäthylens, Z. Phys. Chem. (Neue Folge), 1967, 52, 329-335. [all data]