Benzoic acid, 2-benzoylhydrazide

Condensed phase thermochemistry data

Data compiled by: Hussein Y. Afeefy, Joel F. Liebman, and Stephen E. Stein

Quantity Value Units Method Reference Comment
Δfsolid-202.kJ/molCcbKaryakin, Mochalov, et al., 1975
Δfsolid-213.8 ± 1.3kJ/molCmCole and Gilbert, 1951Reanalyzed by Cox and Pilcher, 1970, Original value = -214.3 kJ/mol
Quantity Value Units Method Reference Comment
Δcsolid-7022.4 ± 6.3kJ/molCcbKaryakin, Mochalov, et al., 1975
Δcsolid-7010.3 ± 1.3kJ/molCmCole and Gilbert, 1951Reanalyzed by Cox and Pilcher, 1970, Original value = -7009.9 kJ/mol
Δcsolid-7010.3 ± 6.7kJ/molCcbAnderson and Gilbert, 1942

References

Karyakin, Mochalov, et al., 1975
Karyakin, N.V.; Mochalov, A.N.; Rabinovich, I.B.; Kamelova, G.P.; Berestneva, G.L.; Astaf'ev, S.A.; Korshak, V.V., Thermodynamics of synthesis of poly-(p,p'-diphenyl-enexido) -1,3,4-oxadiazole by intramolecular cyclodehydration of poly-(p,p'-diphenyleneoxido)-hydrazide, Polym. Sci. USSR, 1975, 17, 2174-2181. [all data]

Cole and Gilbert, 1951
Cole, L.G.; Gilbert, E.C., The heats of combustion of some nitrogen compounds and the apparent energy of the N-N bond, J. Am. Chem. Soc., 1951, 73, 5423-5427. [all data]

Cox and Pilcher, 1970
Cox, J.D.; Pilcher, G., Thermochemistry of Organic and Organometallic Compounds, Academic Press, New York, 1970, 1-636. [all data]

Anderson and Gilbert, 1942
Anderson, C.M.; Gilbert, E.C., The apparent energy of the N-N bond as calculated from heats of combustion, J. Am. Chem. Soc., 1942, 64, 2369-2372. [all data]