Silane, ethenyltriethoxy-

Phase change data

Data compiled as indicated in comments:
BS - Robert L. Brown and Stephen E. Stein
AC - William E. Acree, Jr., James S. Chickos

Quantity Value Units Method Reference Comment
Tboil433. - 434.KN/APCR Inc., 1990BS
Quantity Value Units Method Reference Comment
Δvap50.2 ± 0.8kJ/molCVoronkov, Baryshok, et al., 1988AC
Δvap50.2 ± 0.4kJ/molEBKlyuchnikov, Danilova, et al., 1985AC

Enthalpy of vaporization

ΔvapH (kJ/mol) Temperature (K) Method Reference Comment
46.2349.IJenkins and Chambers, 1954Based on data from 334. - 421. K.; AC

Antoine Equation Parameters

log10(P) = A − (B / (T + C))
    P = vapor pressure (bar)
    T = temperature (K)

View plot Requires a JavaScript / HTML 5 canvas capable browser.

Temperature (K) A B C Reference
334.3 - 421.34.565691735.-53.Jenkins and Chambers, 1954

References

PCR Inc., 1990
PCR Inc., Research Chemicals Catalog 1990-1991, PCR Inc., Gainesville, FL, 1990, 1. [all data]

Voronkov, Baryshok, et al., 1988
Voronkov, M.G.; Baryshok, V.P.; Klyuchnikov, V.A.; Danilova, T.F.; Pepekin, V.I.; Korchagina, A.N.; Khudobin, Yu.I., Thermochemistry of organosilicon compounds, Journal of Organometallic Chemistry, 1988, 345, 1-2, 27-38, https://doi.org/10.1016/0022-328X(88)80231-6 . [all data]

Klyuchnikov, Danilova, et al., 1985
Klyuchnikov, V.A.; Danilova, T.F.; Voronkov, M.G.; D'yakov, V.M., Dokl. Phys. Chem., 1985, 281, 373. [all data]

Jenkins and Chambers, 1954
Jenkins, Arthur C.; Chambers, George F., Vapor Pressures of Silicon Compounds, Ind. Eng. Chem., 1954, 46, 11, 2367-2369, https://doi.org/10.1021/ie50539a043 . [all data]