Dibenzylmercury

Phase change data

Data compiled by: William E. Acree, Jr., James S. Chickos

Enthalpy of sublimation

ΔsubH (kJ/mol) Temperature (K) Method Reference
88.7 ± 2.1350. - 390.ME,TECarson and Spencer, 1984

References

Carson and Spencer, 1984
Carson, A.S.; Spencer, J.A., The enthalpies of formation of bis-benzyl mercury and bis-phenylethynyl mercury and some associated bond-dissociation enthalpies, The Journal of Chemical Thermodynamics, 1984, 16, 5, 423-426, https://doi.org/10.1016/0021-9614(84)90197-6 . [all data]