cobalt dibromide

Phase change data

Data compiled by: William E. Acree, Jr., James S. Chickos

Quantity Value Units Method Reference Comment
Δsub216. ± 1.0kJ/molN/ABardi, Brunetti, et al., 1997

Enthalpy of sublimation

ΔsubH (kJ/mol) Temperature (K) Method Reference Comment
207. ± 4.0802.TEBardi, Brunetti, et al., 1997Based on data from 764. - 911. K.

References

Bardi, Brunetti, et al., 1997
Bardi, Gianpiero; Brunetti, Bruno; Ciccariello, Erasmo; Piacente, Vincenzo, Vapour pressures and sublimation enthalpies of cobalt and nickel dibromides, Journal of Alloys and Compounds, 1997, 247, 1-2, 202-205, https://doi.org/10.1016/S0925-8388(96)02578-9 . [all data]