Benzeneethanol, 2-hydroxy-

Van Den Dool and Kratz RI, non-polar column, temperature ramp

View large format table.

Column type Active phase I Reference Comment
CapillaryHP-5MS1410.Lalel, Singh, et al., 200360. m/0.25 mm/0.25 μm, He, 40. C @ 1. min, 3. K/min, 310. C @ 20. min

Normal alkane RI, polar column, temperature ramp

View large format table.

Column type Active phase I Reference Comment
CapillaryCP Wax 52 CB2839.Birtic, Ginies, et al., 200930. m/0.32 mm/0.50 μm, Helium, 40. C @ 2. min, 4. K/min, 230. C @ 15. min

Phase change data

Data compiled by: Robert L. Brown and Stephen E. Stein

Reduced pressure boiling point

Tboil (K) Pressure (atm) Reference
441.70.003Weast and Grasselli, 1989

References

Lalel, Singh, et al., 2003
Lalel, H.J.D.; Singh, Z.; Chye Tan, S., Glycosidically-bound aroma volatile compounds in the skin and pulp of 'Kensington Pride' mango fruit at different stages of maturity, Postharvest Biol. Technol., 2003, 29, 2, 205-218, https://doi.org/10.1016/S0925-5214(02)00250-8 . [all data]

Birtic, Ginies, et al., 2009
Birtic, S.; Ginies, C.; Causse, M.; Renard, C.M.G.C.; Page, D., Changes in volatiles and glycosides during fruit maturartion of two contrasted tomato (Solanum lycopersicum) lines, J. Agric. Food Chem., 2009, 57, 2, 591-598, https://doi.org/10.1021/jf8023062 . [all data]