3,3-Dimethyl-3-silathietane

Gas phase ion energetics data

Data compiled as indicated in comments:
LBLHLM - Sharon G. Lias, John E. Bartmess, Joel F. Liebman, John L. Holmes, Rhoda D. Levin, and W. Gary Mallard
LLK - Sharon G. Lias, Rhoda D. Levin, and Sherif A. Kafafi

Ionization energy determinations

IE (eV) Method Reference Comment
8.1PETraven, Rokitskaya, et al., 1986LBLHLM
8.25 ± 0.03PIGusel'nikov, Volkova, et al., 1981LLK
8.49PETraven, Rokitskaya, et al., 1986Vertical value; LBLHLM

Appearance energy determinations

Ion AE (eV) Other Products MethodReferenceComment
C2H6SSi+9.23 ± 0.03C2H4PIGusel'nikov, Volkova, et al., 1981LLK
C3H8Si+9.15 ± 0.04CH2SPIGusel'nikov, Volkova, et al., 1981LLK

References

Traven, Rokitskaya, et al., 1986
Traven, V.F.; Rokitskaya, V.I.; Rodin, O.G.; Shvets, A.F.; Redchenko, V.V.; Voronkov, M.G.; Kirpichenko, S.V.; Suslova, E.N., Photoelectron spectrum and orbital structure of 3,3-dimethyl-3-silathietane, Dokl. Phys. Chem., 1986, 288, 522. [all data]

Gusel'nikov, Volkova, et al., 1981
Gusel'nikov, L.E.; Volkova, V.V.; Zaikin, V.G.; Tarasenko, N.A.; Tishenkov, A.A.; Nametkin, N.S.; Voronkov, M.G.; Kirpichenko, S.V., Mass spectra of 3,3-dimethyl-3-silathietane and 3,3-diethyl-2,4-dimethyl-3-silathietane. First observation of silathione ions and calculation of their heats of formation, J. Organomet. Chem., 1981, 215, 9. [all data]