2-Methoxy-3,6-dichloro-phenol

Phase change data

Data compiled by: Thermodynamics Research Center, NIST Boulder Laboratories, Chris Muzny director

Quantity Value Units Method Reference Comment
Tfus343.KN/AKnuutinen and Tarhanen, 1981Uncertainty assigned by TRC = 4. K

In addition to the Thermodynamics Research Center (TRC) data available from this site, much more physical and chemical property data is available from the following TRC products:

References

Knuutinen and Tarhanen, 1981
Knuutinen, J.S.; Tarhanen, J.T., Limited Methylation of CHlorinated 1,2-Benzenediols to Chlorinated 2-Methoxyphenols, J. Chem. Eng. Data, 1981, 26, 347. [all data]