2-Propanone, 1-(1-cyclohexen-1-yl)-

Reaction thermochemistry data

Data compiled by: Hussein Y. Afeefy, Joel F. Liebman, and Stephen E. Stein

Individual Reactions

2-Propanone, 1-(1-cyclohexen-1-yl)- = 2-Propanone, 1-cyclohexylidene-

By formula: C9H14O = C9H14O

Quantity Value Units Method Reference Comment
Δr-12.kJ/molEqkSvata and Prochazka, 1975liquid phase; solvent: t-Butyl alcohol; Heat of isomerisation

References

Svata and Prochazka, 1975
Svata, V.; Prochazka, M., Relative stability of alicyclic compounds containing an exocyclic and and endocyclic double bond, Collect. Czech. Chem. Commun., 1975, 40, 2315-2325. [all data]