(Z) 1-(4-Methoxyphenyl)-3-phenyl-3-thioxo-1-propen-1-ol

Reaction thermochemistry data

Data compiled by: Hussein Y. Afeefy, Joel F. Liebman, and Stephen E. Stein

Individual Reactions

(Z) 1-(4-Methoxyphenyl)-3-phenyl-3-thioxo-1-propen-1-ol = C16H14O2S

By formula: C16H14O2S = C16H14O2S

Quantity Value Units Method Reference Comment
Δr-67.8kJ/molEqkCarlsen and Duus, 1980liquid phase; solvent: Alcohol

References

Carlsen and Duus, 1980
Carlsen, L.; Duus, F., β-Thioxoketones. Part 6. Electronic absorption spectra of aromatic β-Thioxoketones. A study of enol-enethiol tautomerism, J. Chem. Soc. Perkin Trans. 2, 1980, 1768-1773. [all data]