Cyclopropa[b]naphthalene, 1,1-difluoro-

Gas phase ion energetics data

Data compiled by: Sharon G. Lias and Joel F. Liebman

Ionization energy determinations

IE (eV) Method Reference Comment
8.58PELecoultre, Heilbronner, et al., 1988Vertical value

References

Lecoultre, Heilbronner, et al., 1988
Lecoultre, J.; Heilbronner, E.; Muller, P.; Rodriguez, D., The influence of fluoro substituents on cyclopropa, -benzene, -naphthalene, and -anthracene, Collect. Czech. Chem. Commun., 1988, 53, 2385. [all data]