3-Hydroperoxy-n-heptane

Condensed phase thermochemistry data

Data compiled by: Hussein Y. Afeefy, Joel F. Liebman, and Stephen E. Stein

Quantity Value Units Method Reference Comment
Δcliquid-4694.4 ± 4.2kJ/molCcbPritzkow and Muller, 1956Corresponding Δfliquid = -347. kJ/mol (simple calculation by NIST; no Washburn corrections)

References

Pritzkow and Muller, 1956
Pritzkow, W.; Muller, K.A., Uber die energetische stellung der organischen hydroperoxyde und die o-o-bindungsenergie, Chem. Ber., 1956, 89, 2318-2321. [all data]