Methanone,(2-bromophenyl)-2-pyridinyl-

Gas phase ion energetics data

Data compiled by: Sharon G. Lias, Rhoda D. Levin, and Sherif A. Kafafi

Ionization energy determinations

IE (eV) Method Reference
8.93EISchubert and Grutzmacher, 1980

Appearance energy determinations

Ion AE (eV) Other Products MethodReferenceComment
C12H8NO+9.37BrEISchubert and Grutzmacher, 1980

References

Schubert and Grutzmacher, 1980
Schubert, R.; Grutzmacher, H.-F., Kinetic energy release and position of transition state during the intramolecular substitution of ionized 2-benzoyl pyridines, Org. Mass Spectrom., 1980, 15, 122. [all data]