Ethane, 1,1,1,2-tetrachloro-2,2-difluoro-

Reaction thermochemistry data

Data compiled by: Hussein Y. Afeefy, Joel F. Liebman, and Stephen E. Stein

Individual Reactions

Chlorine + Ethene, 1,1-dichloro-2,2-difluoro- = Ethane, 1,1,1,2-tetrachloro-2,2-difluoro-

By formula: Cl2 + C2Cl2F2 = C2Cl4F2

Quantity Value Units Method Reference Comment
Δr-171.9 ± 2.3kJ/molCmLacher, McKinley, et al., 1949gas phase; Heat of chlorination at 363 °K

Phase change data

Data compiled as indicated in comments:
BS - Robert L. Brown and Stephen E. Stein
TRC - Thermodynamics Research Center, NIST Boulder Laboratories, Chris Muzny director
DH - Eugene S. Domalski and Elizabeth D. Hearing

Quantity Value Units Method Reference Comment
Tboil364.6KN/APCR Inc., 1990BS
Tboil364.7KN/AWeast and Grasselli, 1989BS
Quantity Value Units Method Reference Comment
Tfus314.2KN/AGolovanova and Kolesov, 1984Uncertainty assigned by TRC = 0.2 K; TRC

Enthalpy of fusion

ΔfusH (kcal/mol) Temperature (K) Reference Comment
0.9536314.2Golovanova and Kolesov, 1984, 2DH

Entropy of fusion

ΔfusS (cal/mol*K) Temperature (K) Reference Comment
3.04314.2Golovanova and Kolesov, 1984, 2DH

In addition to the Thermodynamics Research Center (TRC) data available from this site, much more physical and chemical property data is available from the following TRC products:

References

Lacher, McKinley, et al., 1949
Lacher, J.R.; McKinley, J.J.; Walden, C.; Lea, K.; Park, J.D., Reaction heats of organic fluorine compounds. II. The vapor phase heats of chlorination of some simple fluoroolefins, J. Am. Chem. Soc., 1949, 71, 1334-1337. [all data]