3,4,5-Trimethoxybenzyl methyl ether

Normal alkane RI, non-polar column, custom temperature program

View large format table.

Column type Active phase I Reference Comment
CapillaryHP-11708.Rowland, Blackman, et al., 199525. m/0.25 mm/0.25 μm; Program: 30 0C (4 min) 6 K/min -> 200 0C 15 K/min -> 250 0C (20 min)

References

Rowland, Blackman, et al., 1995
Rowland, C.Y.; Blackman, A.J.; D'Arcy, B.R.; Rintoul, G.B., Comparison of organic extractives found in leatherwood (Eucryphia lucida) honey and leatherwood flowers and leaves, J. Agric. Food Chem., 1995, 43, 3, 753-763, https://doi.org/10.1021/jf00051a036 . [all data]