Acetone cyanohydrin

Gas phase ion energetics data

Data compiled by: Sharon G. Lias, John E. Bartmess, Joel F. Liebman, John L. Holmes, Rhoda D. Levin, and W. Gary Mallard

Ionization energy determinations

IE (eV) Method Reference
11.09PEKoppel, Molder, et al., 1983

Condensed phase thermochemistry data

Data compiled by: Hussein Y. Afeefy, Joel F. Liebman, and Stephen E. Stein

Quantity Value Units Method Reference Comment
Δfliquid-28.9 ± 0.2kcal/molCcbGubareva, Igolinskaya, et al., 1987
Quantity Value Units Method Reference Comment
Δcliquid-585.7 ± 0.2kcal/molCcbGubareva, Igolinskaya, et al., 1987

Phase change data

Data compiled as indicated in comments:
BS - Robert L. Brown and Stephen E. Stein
TRC - Thermodynamics Research Center, NIST Boulder Laboratories, Chris Muzny director
AC - William E. Acree, Jr., James S. Chickos

Quantity Value Units Method Reference Comment
Tfus251.9KN/AAnonymous, 1954Uncertainty assigned by TRC = 0.6 K; TRC

Reduced pressure boiling point

Tboil (K) Pressure (atm) Reference Comment
355.20.030Weast and Grasselli, 1989BS

Enthalpy of vaporization

ΔvapH (kcal/mol) Temperature (K) Method Reference Comment
25.45370.AStephenson and Malanowski, 1987Based on data from 355. - 393. K.; AC

In addition to the Thermodynamics Research Center (TRC) data available from this site, much more physical and chemical property data is available from the following TRC products:

References

Koppel, Molder, et al., 1983
Koppel, I.A.; Molder, U.H.; Pikver, R.J., Photoelectron spectra of molecules. I. Alcohols, Org. React. Tartu, 1983, 20, 45. [all data]