2,3-Diphenylbenzo-1,4-dioxin

Gas phase ion energetics data

Data compiled as indicated in comments:
LLK - Sharon G. Lias, Rhoda D. Levin, and Sherif A. Kafafi

Ionization energy determinations

IE (eV) Method Reference Comment
7.08 ± 0.02PEBouchoux and Dagaut, 1981LLK

Appearance energy determinations

Ion AE (eV) Other Products MethodReferenceComment
C13H9O+12.8 ± 0.1C6H5COPEBouchoux and Dagaut, 1981LLK
C19H13O+13.1 ± 0.1CHOPEBouchoux and Dagaut, 1981LLK

References

Bouchoux and Dagaut, 1981
Bouchoux, G.; Dagaut, J., Mechanisms of formation of [M-HCO]+ and [M-C6H5CO]+ ions from isomers of 1,4-benzodioxin derivatives, Org. Mass Spectrom., 1981, 16, 246. [all data]