Methylphosphorochlorofluoridate

Phase change data

Data compiled as indicated in comments:
TRC - Thermodynamics Research Center, NIST Boulder Laboratories, Chris Muzny director
DH - Eugene S. Domalski and Elizabeth D. Hearing
AC - William E. Acree, Jr., James S. Chickos

Quantity Value Units Method Reference Comment
Ttriple250.70KN/AFurukawa, Reilly, et al., 1964Uncertainty assigned by TRC = 0.02 K; TRC

Enthalpy of fusion

ΔfusH (kJ/mol) Temperature (K) Method Reference Comment
11.853250.70N/AFurukawa, Reilly, et al., 1964, 2DH
11.85250.7ACFurukawa, Reilly, et al., 1964AC

Entropy of fusion

ΔfusS (J/mol*K) Temperature (K) Reference Comment
47.28250.70Furukawa, Reilly, et al., 1964, 2DH

In addition to the Thermodynamics Research Center (TRC) data available from this site, much more physical and chemical property data is available from the following TRC products:

References

Furukawa, Reilly, et al., 1964
Furukawa, George T.; Reilly, Martin L.; Piccirelli, Jeanette H.; Tenenbaum, Milton, Thermodynamic properties of some methylphosphonyl dihalides from 15 to 335 ÃfÆ'ââ«8218»¬Å¡Ãfâ«8364»së8218»Â°K, J. RES. NATL. BUR. STAN. SECT. A., 1964, 68A, 4, 367, https://doi.org/10.6028/jres.068A.036 . [all data]

Furukawa, Reilly, et al., 1964, 2
Furukawa, G.T.; Reilly, M.L.; Piccirelli, J.H.; Tenenbaum, M., Thermodynamic properties of some methylphosphonyl dihalides from 15 to 335 K, J. Res., 1964, NBS A68, 367-379. [all data]