(E)-3-(2-Bromophenyl)propenoic acid

Condensed phase thermochemistry data

Data compiled by: Hussein Y. Afeefy, Joel F. Liebman, and Stephen E. Stein

Quantity Value Units Method Reference Comment
Δfsolid-305.2kJ/molCcbZavoianu, Ciocazan, et al., 1990
Quantity Value Units Method Reference Comment
Δcsolid-4130.kJ/molCcbZavoianu, Ciocazan, et al., 1990

References

Zavoianu, Ciocazan, et al., 1990
Zavoianu, D.; Ciocazan, I.; Moga-Gheorghe, S.; Bornaz, C., Structure and reactivity of acids. Heats of combustion and formation of some phenylacrylic acids., Rev. Chim. (Bucharest), 1990, 41, 234-236. [all data]