1,3,6,9,12,15,17,20,23,26,29,32-Dodecaoxacyclo-tetratricontane

Reaction thermochemistry data

Data compiled by: Hussein Y. Afeefy, Joel F. Liebman, and Stephen E. Stein

Individual Reactions

1,3,6,9,12,15,17,20,23,26,29,32-Dodecaoxacyclo-tetratricontane = 21,3,6,9,12,15-Hexaoxacycloheptadecane

By formula: C22H44O12 = 2C11H22O6

Quantity Value Units Method Reference Comment
Δr18. ± 1.1kJ/molEqkYamashita, Mayumi, et al., 1980liquid phase; solvent: CH2Cl2

References

Yamashita, Mayumi, et al., 1980
Yamashita, Y.; Mayumi, J.; Kawakami, Y.; Ito, K., Ring-chain equilibrium of macrocyclic formals, Macromolecules, 1980, 13, 1075-1080. [all data]