Lignoceric acid, TMS derivative

Van Den Dool and Kratz RI, non-polar column, temperature ramp

View large format table.

Column type Active phase I Reference Comment
CapillaryOV-12829.Harvey, 198950. m/0.30 mm/0.52 μm, He, 2. K/min; Tstart: 130. C; Tend: 280. C

Van Den Dool and Kratz RI, non-polar column, custom temperature program

View large format table.

Column type Active phase I Reference Comment
CapillaryHP-5MS2826.8Andriamaharavo, 201430. m/0.25 mm/0.25 μm, He; Program: 60C (1 min) => 5 C/min => 210C => 10 C/min => 280C (15 min)

Normal alkane RI, non-polar column, temperature ramp

View large format table.

Column type Active phase I Reference Comment
CapillaryHP-5 MS2835.Erxleben, Gessler, et al., 201230. m/0.25 mm/0.25 μm, 5. K/min; Tstart: 80. C; Tend: 320. C
CapillaryRTX-5 Sil MS2838.Lytovchenko, Beleggia, et al., 200930. m/0.25 mm/0.25 μm, Helium, 70. C @ 5. min, 5. K/min, 310. C @ 1. min
CapillaryHP-52848.Isidorov, Lech, et al., 200830. m/0.25 mm/0.25 μm, Helium, 3. K/min, 300. C @ 30. min; Tstart: 50. C

Normal alkane RI, non-polar column, custom temperature program

View large format table.

Column type Active phase I Reference Comment
CapillaryMethylsiloxane, 5 % Ph groups2837.Cao, Aa, et al., 2011Program: not specified
CapillaryHP-52850.Isidorov, Lech, et al., 200830. m/0.25 mm/0.25 μm, Helium; Program: not specified
CapillaryRTx-5 Sil MS2839.Birkemeier and Kopka, 200730. m/0.25 mm/0.25 μm, Helium; Program: 70 0C (1 min) 1 0C/min -> 76 0C 6.09 0C/min -> 350 0C (1 min) -> 330 0C (10 min)

References

Harvey, 1989
Harvey, D.J., Identification of long-chain fatty acids and alcohols from human cerumen by the use of picolinyl and nicotinate esters, Biomed. Environ. Mass Spectrom., 1989, 18, 9, 719-723, https://doi.org/10.1002/bms.1200180912 . [all data]

Andriamaharavo, 2014
Andriamaharavo, N.R., Retention Data. NIST Mass Spectrometry Data Center., NIST Mass Spectrometry Data Center, 2014. [all data]

Erxleben, Gessler, et al., 2012
Erxleben, A.; Gessler, A.; Vervliet-Scheebaum, M.; Reski, R., Metabolite profiling of the moss Physcomitrella patens reveals evolutionary conservation of osmoprotective substances, Plant Cell Rep., 2012, 31, 2, 427-436, https://doi.org/10.1007/s00299-011-1177-9 . [all data]

Lytovchenko, Beleggia, et al., 2009
Lytovchenko, A.; Beleggia, R.; Schauer, N.; Isaacson, T.; Leuendorf, J.E.; Hellmann, H.; Rose, J.K.C.; Fernie, A.R., Application of GC-MS fpr the detection of lipophilic compounds in diverse plant tissues, Plant Methods, 2009, 5, 4, 1-11. [all data]

Isidorov, Lech, et al., 2008
Isidorov, V.A.; Lech, P.; Zolciak, A.; Rusak, N.; Szczepaniak, L., Gas Chromatographic - nass spectrometric investigation of metabolites from the needles and roots of pine seedlings at early stages of pathogenic fungi Armillaria ostoyae attack, Trees, 2008, 22, 4, 531-542, https://doi.org/10.1007/s00468-008-0213-z . [all data]

Cao, Aa, et al., 2011
Cao, B.; Aa, J.; Wang, G.; Wu, X.; Liu, L.; Li, M.; Shi, J.; Wang, X.; Zhao, C.; Zheng, T.; Guo, S.; Duan, J., GC-TOFMS analysis of metabolites in adherent MDCK cells and a movel strategy for identifying intracellular metabolic markers for use as cell amount indicators in data normalization, Anal. Bioanal. Chem., 2011, 400, 9, 2983-2993, https://doi.org/10.1007/s00216-011-4981-8 . [all data]

Birkemeier and Kopka, 2007
Birkemeier, C.; Kopka, J., Design of metabolite recovery by variations of the metabolite profiling protocol in Concepts in Plant Metabolomics, Nikolau, B.J.; Wurtele, E.S., ed(s)., Springer, Dordrecht, Netheralnds, 2007, 45-69. [all data]