Ethylene glycol, 2TMS derivative

Gas phase ion energetics data

Data compiled by: Sharon G. Lias, Rhoda D. Levin, and Sherif A. Kafafi

Appearance energy determinations

Ion AE (eV) Other Products MethodReferenceComment
C7H19O2Si2+9.5 ± 0.1CH3EIKoppel, Schwarz, et al., 1974

Van Den Dool and Kratz RI, non-polar column, temperature ramp

View large format table.

Column type Active phase I Reference Comment
CapillaryPE-5992.Isidorov and Vinogorova, 2003He, 5. K/min; Column length: 30. m; Column diameter: 0.25 mm; Tstart: 50. C; Tend: 250. C

Van Den Dool and Kratz RI, non-polar column, custom temperature program

View large format table.

Column type Active phase I Reference Comment
CapillaryHP-5MS975.7Andriamaharavo, 201430. m/0.25 mm/0.25 μm, He; Program: 60C (1 min) => 5 C/min => 210C => 10 C/min => 280C (15 min)
CapillaryMethyl Silicone993.Peng, Yang, et al., 1991Program: not specified

Normal alkane RI, non-polar column, temperature ramp

View large format table.

Column type Active phase I Reference Comment
CapillaryHP-5990.Isidorov, Lech, et al., 200830. m/0.25 mm/0.25 μm, Helium, 3. K/min, 300. C @ 30. min; Tstart: 50. C
CapillaryHP-5989.Isidorov, Kotowska, et al., 200530. m/0.25 mm/0.25 μm, He, 5. K/min; Tstart: 50. C; Tend: 300. C

References

Koppel, Schwarz, et al., 1974
Koppel, C.; Schwarz, H.; Bohlmann, F., Energetische betrachtungen zur intramolekularen solvatisierung von ionen bei der elektronenstossinduzierten fragmentierung von α,ω-bis-(trimethylsilyl)-athern, Org. Mass Spectrom., 1974, 9, 567. [all data]