1,1,2,2-Cyclobutanetetracarbonitrile, 3-methoxy-3-phenyl-

Reaction thermochemistry data

Data compiled by: Hussein Y. Afeefy, Joel F. Liebman, and Stephen E. Stein

Individual Reactions

Benzene, (1-methoxyethenyl)- + Tetracyanoethylene = 1,1,2,2-Cyclobutanetetracarbonitrile, 3-methoxy-3-phenyl-

By formula: C9H10O + C6N4 = C15H10N4O

Quantity Value Units Method Reference Comment
Δr-51.8kJ/molCmSolomonov, Antipin, et al., 1979liquid phase; solvent: methylene chloride

References

Solomonov, Antipin, et al., 1979
Solomonov, B.N.; Antipin, I.S.; Konovalov, A.I.; Novikov, V.B., Solvation effects in the retro[2 + 2]cycloaddition reaction, Zh. Org. Khim., 1979, 15, 2466-24. [all data]