Ethyl-2-chlorobenzoate

Kovats' RI, non-polar column, isothermal

View large format table.

Column type Active phase Temperature (C) I Reference Comment
CapillarySE-30140.1322.Korhonen and Lind, 1985
CapillarySE-30160.1325.Korhonen and Lind, 1985
CapillarySE-30180.1341.Korhonen and Lind, 1985
CapillarySE-30160.1327.Korhonen and Lind, 1985, 2N2; Column length: 25. m; Column diameter: 0.33 mm
CapillarySE-30180.1334.Korhonen and Lind, 1985, 2N2; Column length: 25. m; Column diameter: 0.33 mm
CapillarySE-30200.1342.Korhonen and Lind, 1985, 2N2; Column length: 25. m; Column diameter: 0.33 mm

Kovats' RI, polar column, isothermal

View large format table.

Column type Active phase Temperature (C) I Reference Comment
CapillaryOV-351160.1971.Korhonen and Lind, 1985, 2N2; Column length: 25. m; Column diameter: 0.32 mm
CapillaryOV-351180.1971.Korhonen and Lind, 1985, 2N2; Column length: 25. m; Column diameter: 0.32 mm
CapillaryOV-351200.2007.Korhonen and Lind, 1985, 2N2; Column length: 25. m; Column diameter: 0.32 mm

Van Den Dool and Kratz RI, non-polar column, temperature ramp

View large format table.

Column type Active phase I Reference Comment
CapillarySE-301320.Korhonen and Lind, 198510. K/min; Tstart: 100. C; Tend: 280. C
CapillarySE-301321.Korhonen and Lind, 19852. K/min; Tstart: 100. C; Tend: 280. C
CapillarySE-301311.Korhonen and Lind, 19856. K/min; Tstart: 100. C; Tend: 280. C
CapillarySE-301321.Korhonen and Lind, 1985, 2N2, 10. K/min; Column length: 25. m; Column diameter: 0.33 mm; Tstart: 100. C; Tend: 320. C
CapillarySE-301309.Korhonen and Lind, 1985, 2N2, 2. K/min; Column length: 25. m; Column diameter: 0.33 mm; Tstart: 100. C; Tend: 320. C
CapillarySE-301317.Korhonen and Lind, 1985, 2N2, 6. K/min; Column length: 25. m; Column diameter: 0.33 mm; Tstart: 100. C; Tend: 320. C

Van Den Dool and Kratz RI, non-polar column, custom temperature program

View large format table.

Column type Active phase I Reference Comment
Capillary5 % Phenyl methyl siloxane1343.1Zaikin, 2003Column length: 30. m; Column diameter: 0.19 mm; Program: 50 C to 120 C at 5 C/min; 120 C to 290 C at 12 C/min

Van Den Dool and Kratz RI, polar column, temperature ramp

View large format table.

Column type Active phase I Reference Comment
CapillaryOV-3511964.Korhonen and Lind, 1985, 2N2, 10. K/min; Column length: 25. m; Column diameter: 0.32 mm; Tstart: 100. C; Tend: 230. C
CapillaryOV-3511929.Korhonen and Lind, 1985, 2N2, 2. K/min; Column length: 25. m; Column diameter: 0.32 mm; Tstart: 100. C; Tend: 230. C
CapillaryOV-3511952.Korhonen and Lind, 1985, 2N2, 6. K/min; Column length: 25. m; Column diameter: 0.32 mm; Tstart: 100. C; Tend: 230. C

References

Korhonen and Lind, 1985
Korhonen, I.O.O.; Lind, M.A., Gas-liquid chromatographic analyses. XLI. Ethyl and ω-chloroethyl esters of benzoic and monochlorobenzoic acids on SE-30 and OV-351 capillary columns, J. Chromatogr., 1985, 325, 433-443, https://doi.org/10.1016/S0021-9673(00)96054-0 . [all data]

Korhonen and Lind, 1985, 2
Korhonen, I.O.O.; Lind, M.A., Gas-liquid chromatographic analyses. XXXV. Capillary column studies of C1-C12 n-alkyl esters of benzoic and monochlorobenzoic acids, J. Chromatogr., 1985, 322, 83-96, https://doi.org/10.1016/S0021-9673(01)97661-7 . [all data]

Zaikin, 2003
Zaikin, V.G., Personal Communication: Retention indices measured during the period 2001 to 2003, 2003. [all data]