Tricyclo[3.3.1.1(3,7)]decane, 2-bromo-

Gas phase ion energetics data

Data compiled as indicated in comments:
LLK - Sharon G. Lias, Rhoda D. Levin, and Sherif A. Kafafi

Ionization energy determinations

IE (eV) Method Reference Comment
9.31 ± 0.05PEWorley, Mateescu, et al., 1973LLK

References

Worley, Mateescu, et al., 1973
Worley, S.D.; Mateescu, G.D.; McFarland, C.W.; Fort, R.C., Jr.; Sheley, C.F., Photoelectron spectra and MINDO-SCF-MO calculations for adamantane and some of its derivatives, J. Am. Chem. Soc., 1973, 95, 7580. [all data]