Dimethylphenobarbital

Kovats' RI, non-polar column, isothermal

View large format table.

Column type Active phase Temperature (C) I Reference Comment
PackedSE-30180.1881.Gambaro, Mariani, et al., 1982Gas Chrom P (100-120 mesh); Column length: 1.8 m
PackedSE-30180.1870.Gambaro, Mariani, et al., 1982Gas Chrom P (100-120 mesh); Column length: 1.8 m
PackedSE-30180.1880.Gambaro, Mariani, et al., 1982Gas Chrom P (100-120 mesh); Column length: 1.8 m
PackedSE-30180.1880.Gambaro, Mariani, et al., 1982Gas Chrom P (100-120 mesh); Column length: 1.8 m
PackedSE-30180.1881.Gambaro, Mariani, et al., 1982Gas Chrom P (100-120 mesh); Column length: 1.8 m

Normal alkane RI, non-polar column, temperature ramp

View large format table.

Column type Active phase I Reference Comment
PackedSE-301832.MHA, 9999Nitrogen, Chromosorb G AW DMCS (80-100 mesh); Column length: 2. m; Tstart: 100. C; Tend: 300. C
PackedSE-301831.MHA, 9999Nitrogen, Chromosorb G AW DMCS (80-100 mesh); Column length: 2. m; Tstart: 100. C; Tend: 300. C
CapillaryDB-11826.Sharp, 198715. m/0.25 mm/0.25 μm, He, 130. C @ 1. min, 10. K/min, 290. C @ 10. min
CapillaryDB-11825.Sharp, 198715. m/0.25 mm/0.25 μm, He, 130. C @ 1. min, 10. K/min, 290. C @ 10. min

References

Gambaro, Mariani, et al., 1982
Gambaro, V.; Mariani, R.; Marozzi, E., Flash alkylation for the identification of barbiturates in biological material, J. Anal. Toxicol., 1982, 6, 6, 321-323, https://doi.org/10.1093/jat/6.6.321 . [all data]

MHA, 9999
MHA, Directorate of ForensicScience., Forensic Toxicology, 9999. [all data]

Sharp, 1987
Sharp, M.E., A rapid screening procedure for acidic and neutral drugs in blood by high resolution gas chromatography, J. Anal. Toxicol., 1987, 11, 1, 8-11, https://doi.org/10.1093/jat/11.1.8 . [all data]