Pyridine, 3-methoxy-

Van Den Dool and Kratz RI, non-polar column, temperature ramp

View large format table.

Column type Active phase I Reference Comment
CapillaryDB-1966.Kim, 200160. m/0.32 mm/1. μm, He, 40. C @ 5. min, 2. K/min; Tend: 220. C

Van Den Dool and Kratz RI, polar column, temperature ramp

View large format table.

Column type Active phase I Reference Comment
CapillarySupelcowax-101584.Chung, 199960. m/0.25 mm/0.25 μm, He, 35. C @ 5. min, 2. K/min, 195. C @ 90. min
CapillaryDB-Wax1579.Shiratsuchi, Shimoda, et al., 199360. m/0.25 mm/0.25 μm, 50. C @ 4. min, 2. K/min, 230. C @ 30. min

Normal alkane RI, non-polar column, temperature ramp

View large format table.

Column type Active phase I Reference Comment
CapillaryDB-1960.Lee, Lee, et al., 200560. m/0.32 mm/0.25 μm, He, 35. C @ 4. min, 2. K/min, 230. C @ 25. min
CapillaryDB-1963.Lee, Lee, et al., 200560. m/0.32 mm/0.25 μm, He, 35. C @ 4. min, 2. K/min, 230. C @ 25. min
CapillaryHP-5998.Boylston and Viniyard, 199850. m/0.32 mm/0.52 μm, 35. C @ 15. min, 2. K/min, 250. C @ 45. min

Normal alkane RI, non-polar column, custom temperature program

View large format table.

Column type Active phase I Reference Comment
CapillaryCP Sil 5 CB993.Guyot, Bouseta, et al., 199850. m/0.32 mm/1.2 μm, He; Program: 30C => 55C/min => 85C => 1C/min => 145C => 3C/min => 250C

Normal alkane RI, polar column, temperature ramp

View large format table.

Column type Active phase I Reference Comment
CapillaryAT-Wax1576.Kiss, Csoka, et al., 201160. m/0.25 mm/0.25 μm, Helium, 4. K/min; Tstart: 60. C; Tend: 280. C
CapillaryDB-Wax1579.Shimoda, Shiratsuchi, et al., 199360. m/0.25 mm/0.25 μm, He, 50. C @ 4. min, 2. K/min; Tend: 230. C

Normal alkane RI, polar column, custom temperature program

View large format table.

Column type Active phase I Reference Comment
CapillaryDB-Wax1570.Lee, Lee, et al., 200560. m/0.32 mm/0.25 μm, He; Program: 30C(4min) => 2C/min => 170C(25min) => 10C/min => 210C(10min)
CapillaryDB-Wax1581.Lee, Lee, et al., 200560. m/0.32 mm/0.25 μm, He; Program: 30C(4min) => 2C/min => 170C(25min) => 10C/min => 210C(10min)

References

Kim, 2001
Kim, J.S., Einfluss der Temperatur beim Rösten von Sesam auf Aroma und antioxidative Eigenschaften des Öls, PhD Thesis, Technischen Universität Berlin zur Erlangung des akademischen Grades, Berlin, 2001, 151. [all data]

Chung, 1999
Chung, H.Y., Volatile components in fermented soybean (Glycine max) curds, J. Agric. Food Chem., 1999, 47, 7, 2690-2696, https://doi.org/10.1021/jf981166a . [all data]

Shiratsuchi, Shimoda, et al., 1993
Shiratsuchi, H.; Shimoda, M.; Minegishi, Y.; Osajima, Y., Isolation and identification of volatile flavor compounds in nonfermented coarse-cut sausage. Flavor as a quality factor of nonfermented sausage. 1, J. Agric. Food Chem., 1993, 41, 4, 647-652, https://doi.org/10.1021/jf00028a027 . [all data]

Lee, Lee, et al., 2005
Lee, K.-G.; Lee, S.-E.; Takeoka, G.R.; Kim, J.-H.; Park, B.-S., Antioxidant activity and characterization of volatile constituents of beechwood creosote, J. Sci. Food Agric., 2005, 85, 9, 1580-1586, https://doi.org/10.1002/jsfa.2156 . [all data]

Boylston and Viniyard, 1998
Boylston, T.D.; Viniyard, B.T., Isolation of volatile flavor compounds from peanut butter using purge-and-trap technique in Instrumental Methods in Food and Beverage Analysis, D. Wetzel and G. Charalambous, ed(s)., 1998, 225-243. [all data]

Guyot, Bouseta, et al., 1998
Guyot, C.; Bouseta, A.; Scheirman, V.; Collin, S., Floral origin markers of chestnut and lime tree honeys, J. Agric. Food Chem., 1998, 46, 2, 625-633, https://doi.org/10.1021/jf970510l . [all data]

Kiss, Csoka, et al., 2011
Kiss, M.; Csoka, M.; Gyorfi, J.; Korany, K., Comparison of the fragrance constituents of Tuber aestivium and Tuber Brumale gathered in Hungary, J. Appl. Botany Food Quality, 2011, 84, 102-110. [all data]

Shimoda, Shiratsuchi, et al., 1993
Shimoda, M.; Shiratsuchi, H.; Minegishi, Y.; Osajima, Y., Flavor deterioration of nonfermented coarse-cut sausage during storage. Flavor as a factor of quality for nonfermented sausage. 2, J. Agric. Food Chem., 1993, 41, 6, 946-950, https://doi.org/10.1021/jf00030a021 . [all data]