3-(Trifluoromethyl)benzophenone

Phase change data

Data compiled by: Robert L. Brown and Stephen E. Stein

Reduced pressure boiling point

Tboil (K) Pressure (bar) Reference
371. - 372.0.0005PCR Inc., 1990

Gas phase ion energetics data

Data compiled by: John E. Bartmess

Electron affinity determinations

EA (eV) Method Reference Comment
0.958 ± 0.087IMREHuh, Kang, et al., 1999ΔG(EA) 343K; anchored to ΔG value. Including anchor ΔS, EA is ca. 0.4 kcal/mol more bound.

References

PCR Inc., 1990
PCR Inc., Research Chemicals Catalog 1990-1991, PCR Inc., Gainesville, FL, 1990, 1. [all data]