Chlorothioformylsulfenylchloride

Condensed phase thermochemistry data

Data compiled by: Hussein Y. Afeefy, Joel F. Liebman, and Stephen E. Stein

Quantity Value Units Method Reference Comment
Δfliquid-24.kJ/molEqkRaskina, Suvorov, et al., 1972

References

Raskina, Suvorov, et al., 1972
Raskina, A.D.; Suvorov, B.A.; Zetkin, V.I.; Kolesnikov, I.M.; Zakharov, E.V., Calculation of thermodynamic data for reactions of carbon disulfide chlorination, J. Appl. Chem. USSR, 1972, 45, 683-685. [all data]