Oxazole, 2,4-dimethyl-

Gas phase ion energetics data

Data compiled by: Sharon G. Lias, John E. Bartmess, Joel F. Liebman, John L. Holmes, Rhoda D. Levin, and W. Gary Mallard

Ionization energy determinations

IE (eV) Method Reference Comment
9.1PEKobayashi, Kubota, et al., 1982
9.34PEKobayashi, Kubota, et al., 1982Vertical value

References

Kobayashi, Kubota, et al., 1982
Kobayashi, T.; Kubota, T.; Ezumi, K.; Utsunomiya, C., Photoelectron angular distribution study of some isoxazoles combined with perturbation theoretic approach, Bull. Chem. Soc. Jpn., 1982, 55, 3915. [all data]