9(10H)-Acridinone, 10-methyl-

Phase change data

Data compiled by: William E. Acree, Jr., James S. Chickos

Enthalpy of fusion

ΔfusH (kJ/mol) Temperature (K) Method Reference
29.7479.DSCStoroniak, Krzyminski, et al., 2003

References

Storoniak, Krzyminski, et al., 2003
Storoniak, P.; Krzyminski, K.; Bouzyk, A.; Koval'chuk, E.P.; Blazejowski, J., Melting, volatilisation and crystal lattice enthalpies of acridin-9(10H)-ones, Journal of Thermal Analysis and Calorimetry, 2003, 74, 2, 443-450, https://doi.org/10.1023/B:JTAN.0000005179.91819.6d . [all data]